Target
5-hydroxytryptamine receptor 6
Ligand
BDBM50328461
Substrate
Meas. Tech.
ChEMBL_665589 (CHEMBL1261473)
Ki
266±n/a nM
Citation
 Vázquez-Villa, HGonzález-Vera, JABenhamú, BViso, AFernández de la Pradilla, RJunquera, EAicart, ELópez-Rodríguez, MLOrtega-Gutiérrez, S Development of molecular probes for the human 5-HT(6) receptor. J Med Chem 53:7095-106 (2010)  
Target
Name:
5-hydroxytryptamine receptor 6
Synonyms:
5-HT-6 5-hydroxytryptamine receptor 6 (5-HT-6) 5-hydroxytryptamine receptor 6 (5HT6) HTR6 Serotonin 6 (5-HT6) receptor | Serotonin Receptor 6
Type:
G Protein-Coupled Receptor (GPCR)
Mol. Mass.:
46968.43
Organism:
Homo sapiens (Human)
Description:
P50406
Residue:
440
  
Inhibitor
Name:
BDBM50328461
Synonyms:
5-Chloro-N-(3-{4-[6-({[5-(dimethylamino)-1-naphthyl]sulfonyl}-amino)hexyl]piperazin-1-yl}-4-methoxyphenyl)-3-methyl-1-benzothiophene-2-sulfonamide | CHEMBL1256250
Type:
Small organic molecule
Emp. Form.:
C38H46ClN5O5S3
Mol. Mass.:
784.45
SMILES:
COc1ccc(NS(=O)(=O)c2sc3ccc(Cl)cc3c2C)cc1N1CCN(CCCCCCNS(=O)(=O)c2cccc3c(cccc23)N(C)C)CC1
: