Target
Alpha-1B adrenergic receptor
Ligand
BDBM50122807
Substrate
Meas. Tech.
ChEMBL_665657 (CHEMBL1261588)
Ki
6±n/a nM
Citation
 Kristensen, JLPüschl, AJensen, MRisgaard, RChristoffersen, CTBang-Andersen, BBalle, T Exploring the neuroleptic substituent in octoclothepin: potential ligands for positron emission tomography with subnanomolar affinity fora(1)-adrenoceptors. J Med Chem 53:7021-34 (2010)  
Target
Name:
Alpha-1B adrenergic receptor
Synonyms:
ADA1B_MESAU Adrenergic receptor alpha adrenergic Alpha1B
Type:
Enzyme Catalytic Domain
Mol. Mass.:
56514.13
Organism:
C.H.O.
Description:
adrenergic Alpha1B ADRA1B C.H.O.::P18841
Residue:
515
  
Inhibitor
Name:
BDBM50122807
Synonyms:
1-(2-{4-[1-(4-Fluoro-phenyl)-5-(1-methyl-1H-[1,2,3]triazol-4-yl)-1H-indol-3-yl]-piperidin-1-yl}-ethyl)-imidazolidin-2-one | CHEMBL328187
Type:
Small organic molecule
Emp. Form.:
C27H30FN7O
Mol. Mass.:
487.5718
SMILES:
Cn1cc(nn1)-c1ccc2n(cc(C3CCN(CCN4CCNC4=O)CC3)c2c1)-c1ccc(F)cc1
: