Target
D(2) dopamine receptor
Ligand
BDBM50328499
Substrate
Meas. Tech.
ChEMBL_665665 (CHEMBL1261596)
Ki
1.9±n/a nM
Citation
 Kristensen, JLPüschl, AJensen, MRisgaard, RChristoffersen, CTBang-Andersen, BBalle, T Exploring the neuroleptic substituent in octoclothepin: potential ligands for positron emission tomography with subnanomolar affinity fora(1)-adrenoceptors. J Med Chem 53:7021-34 (2010)  
Target
Name:
D(2) dopamine receptor
Synonyms:
D(2) dopamine receptor DOPAMINE D2 Long DRD2 Dopamine D2 receptor Dopamine D2 receptor (D2R) Dopamine2-like | d2
Type:
Cell-surface receptors
Mol. Mass.:
50647.10
Organism:
Homo sapiens (Human)
Description:
P14416
Residue:
443
  
Inhibitor
Name:
BDBM50328499
Synonyms:
1-Methyl-4-[8-(1-methyl-1H-tetrazol-5-ylmethyl)-10,11-dihydrodibenzo-[b,f]thiepin-10-yl]piperazine | CHEMBL1259129
Type:
Small organic molecule
Emp. Form.:
C22H26N6S
Mol. Mass.:
406.547
SMILES:
CN1CCN(CC1)C1Cc2ccccc2Sc2ccc(Cc3nnnn3C)cc12
: