Target
Alpha-1D adrenergic receptor
Ligand
BDBM50328478
Substrate
Meas. Tech.
ChEMBL_665658 (CHEMBL1261589)
Ki
1±n/a nM
Citation
 Kristensen, JLPüschl, AJensen, MRisgaard, RChristoffersen, CTBang-Andersen, BBalle, T Exploring the neuroleptic substituent in octoclothepin: potential ligands for positron emission tomography with subnanomolar affinity fora(1)-adrenoceptors. J Med Chem 53:7021-34 (2010)  
Target
Name:
Alpha-1D adrenergic receptor
Synonyms:
ADA1D_RAT Adra1d Alpha-1D adrenergic receptor | Serotonin 1a (5-HT1a) receptor/Adrenergic receptor alpha-1
Type:
Protein
Mol. Mass.:
59375.97
Organism:
Rattus norvegicus (Rat)
Description:
P23944
Residue:
561
  
Inhibitor
Name:
BDBM50328478
Synonyms:
1-Methyl-4-(8-(2-methyl-2H-tetrazol-5-yl)-10,11-dihydrodibenzo[b,f]thiepin-10-yl)piperazine | CHEMBL1259216
Type:
Small organic molecule
Emp. Form.:
C21H24N6S
Mol. Mass.:
392.52
SMILES:
CN1CCN(CC1)C1Cc2ccccc2Sc2ccc(cc12)-c1nnn(C)n1
: