Target
Mitogen-activated protein kinase 14
Ligand
BDBM50328755
Substrate
Meas. Tech.
ChEMBL_673596 (CHEMBL1274709)
IC50
11±n/a nM
Citation
 Ahn, YMClare, MEnsinger, CLHood, MMLord, JWLu, WPMiller, DFPatt, WCSmith, BDVogeti, LKaufman, MDPetillo, PAWise, SCAbendroth, JChun, LClark, RFeese, MKim, HStewart, LFlynn, DL Switch control pocket inhibitors of p38-MAP kinase. Durable type II inhibitors that do not require binding into the canonical ATP hinge region. Bioorg Med Chem Lett 20:5793-8 (2010)  
Target
Name:
Mitogen-activated protein kinase 14
Synonyms:
CSAID-binding protein CSBP1 CSPB1 MAP kinase 14 MAP kinase p38 alpha MAPK14 MK14_HUMAN Mitogen-activated protein kinase p38 alpha Stress-activated protein kinase 2a | p38 MAP kinase alpha/beta
Type:
Serine/threonine-protein kinase
Mol. Mass.:
41286.76
Organism:
Homo sapiens (Human)
Description:
Q16539
Residue:
360
  
Inhibitor
Name:
BDBM50328755
Synonyms:
2-(3-(3-tert-butyl-5-(3-(2,3-dichlorophenyl)ureido)-1H-pyrazol-1-yl)phenyl)acetamide | CHEMBL1271376
Type:
Small organic molecule
Emp. Form.:
C22H23Cl2N5O2
Mol. Mass.:
460.356
SMILES:
CC(C)(C)c1cc(NC(=O)Nc2cccc(Cl)c2Cl)n(n1)-c1cccc(CC(N)=O)c1
: