Target
Nitric oxide synthase, brain
Ligand
BDBM50328815
Substrate
Meas. Tech.
ChEMBL_673784 (CHEMBL1274961)
Ki
290±n/a nM
Citation
 Xue, FLi, HFang, JRoman, LJMartásek, PPoulos, TLSilverman, RB Peripheral but crucial: a hydrophobic pocket (Tyr(706), Leu(337), and Met(336)) for potent and selective inhibition of neuronal nitric oxide synthase. Bioorg Med Chem Lett 20:6258-61 (2010)  
Target
Name:
Nitric oxide synthase, brain
Synonyms:
Constitutive NOS NC-NOS NOS type I nNOS NOS1_HUMAN Neuronal nitric oxide synthase Nitric oxide synthase, neuronal (nNOS) bNOS | nNOS
Type:
Homodimer
Mol. Mass.:
160985.98
Organism:
Homo sapiens (Human)
Description:
P29475
Residue:
1434
  
Inhibitor
Name:
BDBM50328815
Synonyms:
6-(((3R,4R)-4-(2-(3-Fluorophenethylamino)ethoxy)pyrrolidin-3-yl)methyl)pyridin-2-amine CHEMBL1230380
Type:
Small organic molecule
Emp. Form.:
C20H27FN4O
Mol. Mass.:
358.453
SMILES:
Nc1cccc(C[C@@H]2CNC[C@@H]2OCCNCCc2cccc(F)c2)n1
: