Target
PH domain leucine-rich repeat-containing protein phosphatase 2
Ligand
BDBM50246208
Substrate
Meas. Tech.
ChEMBL_673824 (CHEMBL1275001)
IC50
10000±n/a nM
Citation
 Sierecki, ESinko, WMcCammon, JANewton, AC Discovery of small molecule inhibitors of the PH domain leucine-rich repeat protein phosphatase (PHLPP) by chemical and virtual screening. J Med Chem 53:6899-911 (2010)  
Target
Name:
PH domain leucine-rich repeat-containing protein phosphatase 2
Synonyms:
KIAA0931 PHLP2_HUMAN PHLPP2 | PHLPPL
Type:
PROTEIN
Mol. Mass.:
146727.83
Organism:
Homo sapiens (Human)
Description:
ChEMBL_673824
Residue:
1323
  
Inhibitor
Name:
BDBM50246208
Synonyms:
2-(3,4,5-trihydroxy-6-oxo-6H-xanthen-9-yl)cyclohexanecarboxylic acid cid_274122
Type:
Small organic molecule
Emp. Form.:
C20H18O7
Mol. Mass.:
370.3527
SMILES:
OC(=O)C1CCCCC1c1c2ccc(O)c(O)c2oc2c(O)c(=O)ccc12
: