Target
Potassium voltage-gated channel subfamily H member 2
Ligand
BDBM50328877
Substrate
Meas. Tech.
ChEMBL_673956 (CHEMBL1275133)
Ki
>10000±n/a nM
Citation
 Rankovic, ZCai, JKerr, JFradera, XRobinson, JMistry, AFinlay, WMcGarry, GAndrews, FCaulfield, WCumming, IDempster, MWaller, JArbuckle, WAnderson, MMartin, IMitchell, ALong, CBaugh, MWestwood, PKinghorn, EJones, PUitdehaag, JCvan Zeeland, MPotin, DSaniere, LFouquet, AChevallier, FDeronzier, HDorleans, CNicolai, E Optimisation of 2-cyano-pyrimidine inhibitors of cathepsin K: improving selectivity over hERG. Bioorg Med Chem Lett 20:6237-41 (2010)  
Target
Name:
Potassium voltage-gated channel subfamily H member 2
Synonyms:
1,3-beta-glucan synthase component GLS2 ERG Eag-related protein 1 Ether-a-go-go-related gene (HERG) Ether-a-go-go-related gene potassium channel 1 Ether-a-go-go-related gene potassium channel 1 (hERG1) Ether-a-go-go-related protein 1 H-ERG KCNH2 Potassium voltage-gated channel subfamily H member 2 (hERG) Voltage-gated potassium channel subunit Kv11.1 hERG Potassium Channel 1 | putative potassium channel subunit
Type:
Multi-pass membrane protein
Mol. Mass.:
126672.65
Organism:
Homo sapiens (Human)
Description:
Q12809
Residue:
1159
  
Inhibitor
Name:
BDBM50328877
Synonyms:
3-(2-cyano-6-propylpyrimidin-4-yl)-N,N-dimethyl-5-(trifluoromethyl)benzamide | CHEMBL1271069
Type:
Small organic molecule
Emp. Form.:
C18H17F3N4O
Mol. Mass.:
362.349
SMILES:
CCCc1cc(nc(n1)C#N)-c1cc(cc(c1)C(F)(F)F)C(=O)N(C)C
: