Target
Cathepsin K
Ligand
BDBM50328887
Substrate
Meas. Tech.
ChEMBL_673957 (CHEMBL1275134)
IC50
9±n/a nM
Citation
 Rankovic, ZCai, JKerr, JFradera, XRobinson, JMistry, AFinlay, WMcGarry, GAndrews, FCaulfield, WCumming, IDempster, MWaller, JArbuckle, WAnderson, MMartin, IMitchell, ALong, CBaugh, MWestwood, PKinghorn, EJones, PUitdehaag, JCvan Zeeland, MPotin, DSaniere, LFouquet, AChevallier, FDeronzier, HDorleans, CNicolai, E Optimisation of 2-cyano-pyrimidine inhibitors of cathepsin K: improving selectivity over hERG. Bioorg Med Chem Lett 20:6237-41 (2010)  
Target
Name:
Cathepsin K
Synonyms:
CATK_HUMAN CTSO Cathepsin O Cathepsin X
Type:
Enzyme
Mol. Mass.:
36975.68
Organism:
Homo sapiens (Human)
Description:
P43235
Residue:
329
  
Inhibitor
Name:
BDBM50328887
Synonyms:
4-(3-morpholinopropyl)-6-(3-(trifluoromethyl)phenyl)pyrimidine-2-carbonitrile | CHEMBL1269955
Type:
Small organic molecule
Emp. Form.:
C19H19F3N4O
Mol. Mass.:
376.3756
SMILES:
FC(F)(F)c1cccc(c1)-c1cc(CCCN2CCOCC2)nc(n1)C#N
: