Target
Cathepsin K
Ligand
BDBM50328889
Substrate
Meas. Tech.
ChEMBL_673957 (CHEMBL1275134)
IC50
9±n/a nM
Citation
 Rankovic, ZCai, JKerr, JFradera, XRobinson, JMistry, AFinlay, WMcGarry, GAndrews, FCaulfield, WCumming, IDempster, MWaller, JArbuckle, WAnderson, MMartin, IMitchell, ALong, CBaugh, MWestwood, PKinghorn, EJones, PUitdehaag, JCvan Zeeland, MPotin, DSaniere, LFouquet, AChevallier, FDeronzier, HDorleans, CNicolai, E Optimisation of 2-cyano-pyrimidine inhibitors of cathepsin K: improving selectivity over hERG. Bioorg Med Chem Lett 20:6237-41 (2010)  
Target
Name:
Cathepsin K
Synonyms:
CATK_HUMAN CTSO Cathepsin O Cathepsin X
Type:
Enzyme
Mol. Mass.:
36975.68
Organism:
Homo sapiens (Human)
Description:
P43235
Residue:
329
  
Inhibitor
Name:
BDBM50328889
Synonyms:
4-(3-(4-hydroxypiperidin-1-yl)propyl)-6-(3-(trifluoromethyl)phenyl)pyrimidine-2-carbonitrile | CHEMBL1270062
Type:
Small organic molecule
Emp. Form.:
C20H21F3N4O
Mol. Mass.:
390.4021
SMILES:
OC1CCN(CCCc2cc(nc(n2)C#N)-c2cccc(c2)C(F)(F)F)CC1
: