Target
Cathepsin K
Ligand
BDBM50328896
Substrate
Meas. Tech.
ChEMBL_673957 (CHEMBL1275134)
IC50
4±n/a nM
Citation
 Rankovic, ZCai, JKerr, JFradera, XRobinson, JMistry, AFinlay, WMcGarry, GAndrews, FCaulfield, WCumming, IDempster, MWaller, JArbuckle, WAnderson, MMartin, IMitchell, ALong, CBaugh, MWestwood, PKinghorn, EJones, PUitdehaag, JCvan Zeeland, MPotin, DSaniere, LFouquet, AChevallier, FDeronzier, HDorleans, CNicolai, E Optimisation of 2-cyano-pyrimidine inhibitors of cathepsin K: improving selectivity over hERG. Bioorg Med Chem Lett 20:6237-41 (2010)  
Target
Name:
Cathepsin K
Synonyms:
CATK_HUMAN CTSO Cathepsin O Cathepsin X
Type:
Enzyme
Mol. Mass.:
36975.68
Organism:
Homo sapiens (Human)
Description:
P43235
Residue:
329
  
Inhibitor
Name:
BDBM50328896
Synonyms:
1-(3-(2-cyano-6-(3-(trifluoromethyl)phenyl)pyrimidin-4-yl)propylamino)cyclobutanecarboxamide | CHEMBL1270367
Type:
Small organic molecule
Emp. Form.:
C20H20F3N5O
Mol. Mass.:
403.4009
SMILES:
NC(=O)C1(CCC1)NCCCc1cc(nc(n1)C#N)-c1cccc(c1)C(F)(F)F
: