Target
Cytochrome P450 2C19
Ligand
BDBM50328894
Substrate
Meas. Tech.
ChEMBL_673967 (CHEMBL1275144)
IC50
35000±n/a nM
Citation
 Rankovic, ZCai, JKerr, JFradera, XRobinson, JMistry, AFinlay, WMcGarry, GAndrews, FCaulfield, WCumming, IDempster, MWaller, JArbuckle, WAnderson, MMartin, IMitchell, ALong, CBaugh, MWestwood, PKinghorn, EJones, PUitdehaag, JCvan Zeeland, MPotin, DSaniere, LFouquet, AChevallier, FDeronzier, HDorleans, CNicolai, E Optimisation of 2-cyano-pyrimidine inhibitors of cathepsin K: improving selectivity over hERG. Bioorg Med Chem Lett 20:6237-41 (2010)  
Target
Name:
Cytochrome P450 2C19
Synonyms:
CP2CJ_HUMAN CYPIIC17 Cytochrome P450 2C19 (CYP2C19) Mephenytoin 4-hydroxylase P450-254C
Type:
Enzyme
Mol. Mass.:
55935.47
Organism:
Homo sapiens (Human)
Description:
P33261
Residue:
490
  
Inhibitor
Name:
BDBM50328894
Synonyms:
2-(3-(2-cyano-6-(3-(trifluoromethyl)phenyl)pyrimidin-4-yl)propylamino)-2-methylpropanamide | CHEMBL1270269
Type:
Small organic molecule
Emp. Form.:
C19H20F3N5O
Mol. Mass.:
391.3902
SMILES:
CC(C)(NCCCc1cc(nc(n1)C#N)-c1cccc(c1)C(F)(F)F)C(N)=O
: