Target
Cannabinoid receptor 1
Ligand
BDBM50328963
Substrate
Meas. Tech.
ChEMBL_674011 (CHEMBL1275188)
EC50
29.3±n/a nM
Citation
 Zhang, YGilliam, AMaitra, RDamaj, MITajuba, JMSeltzman, HHThomas, BF Synthesis and biological evaluation of bivalent ligands for the cannabinoid 1 receptor. J Med Chem 53:7048-60 (2010)  
Target
Name:
Cannabinoid receptor 1
Synonyms:
Brain-type cannabinoid receptor CB-R CNR1_RAT Cannabinoid receptor Cnr1 | Skr6
Type:
G Protein-Coupled Receptor (GPCR)
Mol. Mass.:
52856.55
Organism:
Rattus norvegicus (rat)
Description:
P20272
Residue:
473
  
Inhibitor
Name:
BDBM50328963
Synonyms:
CHEMBL1269772 | N,N'-[(Methylimino)diundecane-11,1-diyl]bis[5-(4-chlorophenyl)-1-(2,4-dichlorophenyl)-4-methyl-1H-pyrazole-3-carboxamide]
Type:
Small organic molecule
Emp. Form.:
C57H69Cl6N7O2
Mol. Mass.:
1096.921
SMILES:
CN(CCCCCCCCCCCNC(=O)c1nn(c(c1C)-c1ccc(Cl)cc1)-c1ccc(Cl)cc1Cl)CCCCCCCCCCCNC(=O)c1nn(c(c1C)-c1ccc(Cl)cc1)-c1ccc(Cl)cc1Cl
: