Target
1,4-dihydroxy-2-naphthoyl-CoA synthase
Ligand
BDBM50329094
Substrate
Meas. Tech.
ChEMBL_674193 (CHEMBL1274290)
IC50
10000±n/a nM
Citation
 Li, XLiu, NZhang, HKnudson, SESlayden, RATonge, PJ Synthesis and SAR studies of 1,4-benzoxazine MenB inhibitors: novel antibacterial agents against Mycobacterium tuberculosis. Bioorg Med Chem Lett 20:6306-9 (2010)  
Target
Name:
1,4-dihydroxy-2-naphthoyl-CoA synthase
Synonyms:
DHNA-CoA synthase menB
Type:
PROTEIN
Mol. Mass.:
34688.06
Organism:
Mycobacterium tuberculosis
Description:
ChEMBL_817596
Residue:
314
  
Inhibitor
Name:
BDBM50329094
Synonyms:
(Z)-methyl 2-(2-oxo-2H-benzo[b][1,4]oxazin-3(4H)-ylidene)acetate | CHEMBL1269380
Type:
Small organic molecule
Emp. Form.:
C11H9NO4
Mol. Mass.:
219.1935
SMILES:
COC(=O)Cc1nc2ccccc2oc1=O
: