Target
Tyrosine-protein kinase Lck
Ligand
BDBM50329199
Substrate
Meas. Tech.
ChEMBL_674877 (CHEMBL1272506)
IC50
568±n/a nM
Citation
 Belanger, DBWilliams, MJCurran, PJMandal, AKMeng, ZRainka, MPYu, TShih, NYSiddiqui, MALiu, MTevar, SLee, SLiang, LGray, KYaremko, BJones, JSmith, EBPrelusky, DBBasso, AD Discovery of orally bioavailable imidazo[1,2-a]pyrazine-based Aurora kinase inhibitors. Bioorg Med Chem Lett 20:6739-43 (2010)  
Target
Name:
Tyrosine-protein kinase Lck
Synonyms:
2.7.10.2 LCK_HUMAN Leukocyte C-terminal Src kinase Lymphocyte-specific protein tyrosine kinase Protein YT16 Proto-oncogene tyrosine-protein kinase LCK T cell-specific protein-tyrosine kinase
Type:
Mol. Mass.:
57987.83
Organism:
Homo sapiens (Human)
Description:
P06239
Residue:
509
  
Inhibitor
Name:
BDBM50329199
Synonyms:
3-methyl-N-(6-methyl-3-(1H-pyrazol-4-yl)imidazo[1,2-a]pyrazin-8-yl)isothiazol-5-amine | CHEMBL1270796
Type:
Small organic molecule
Emp. Form.:
C14H13N7S
Mol. Mass.:
311.365
SMILES:
Cc1cc(Nc2nc(C)cn3c(cnc23)-c2cn[nH]c2)sn1
: