Target
Sodium channel protein type 2 subunit alpha
Ligand
BDBM50329209
Substrate
Meas. Tech.
ChEMBL_675098 (CHEMBL1272889)
IC50
50±n/a nM
Citation
 Kort, MEAtkinson, RNThomas, JBDrizin, IJohnson, MSSecrest, MAGregg, RJScanio, MJShi, LHakeem, AHMatulenko, MAChapman, MLKrambis, MJLiu, DShieh, CCZhang, XSimler, GMikusa, JPZhong, CJoshi, SHonore, PRoeloffs, RWerness, SAntonio, BMarsh, KCFaltynek, CRKrafte, DSJarvis, MFMarron, BE Subtype-selective Na(v)1.8 sodium channel blockers: identification of potent, orally active nicotinamide derivatives. Bioorg Med Chem Lett 20:6812-5 (2010)  
Target
Name:
Sodium channel protein type 2 subunit alpha
Synonyms:
HBSC II SCN2A SCN2A2 Sodium (Site 2) Sodium channel protein type 2 alpha subunit Voltage-gated sodium channel subunit alpha Nav1.2
Type:
Enzyme
Mol. Mass.:
227954.68
Organism:
Homo sapiens (Human)
Description:
Q99250
Residue:
2005
  
Inhibitor
Name:
BDBM50329209
Synonyms:
5-(4-chlorophenyl)-N-(2-(piperidin-1-yl)benzyl)nicotinamide | CHEMBL1269990
Type:
Small organic molecule
Emp. Form.:
C24H24ClN3O
Mol. Mass.:
405.92
SMILES:
Clc1ccc(cc1)-c1cncc(c1)C(=O)NCc1ccccc1N1CCCCC1
: