Target
C-C motif chemokine 5
Ligand
BDBM50329235
Substrate
Meas. Tech.
ChEMBL_675123 (CHEMBL1272914)
IC50
32±n/a nM
Citation
 Wanner, JChen, LLemoine, RCKondru, RJekle, AHeilek, GdeRosier, AJi, CBerry, PWRotstein, DM Evaluation of amide replacements in CCR5 antagonists as a means to increase intrinsic permeability. Part 2: SAR optimization and pharmacokinetic profile of a homologous azacyle series. Bioorg Med Chem Lett 20:6802-7 (2010)  
Target
Name:
C-C motif chemokine 5
Synonyms:
CCL5 D17S136E Eosinophil chemotactic cytokine RANTES(4-68) SIS-delta T cell-specific protein P228 TCP228
Type:
PROTEIN
Mol. Mass.:
9996.11
Organism:
Homo sapiens (Human)
Description:
ChEMBL_1363187
Residue:
91
  
Inhibitor
Name:
BDBM50329235
Synonyms:
1-(4-(3-((3aR,6aS)-5-(4,6-dimethylpyrimidine-5-carbonyl)hexahydropyrrolo[3,4-c]pyrrol-2(1H)-yl)-1-phenylpropyl)piperidin-1-yl)propan-1-one | CHEMBL1271107
Type:
Small organic molecule
Emp. Form.:
C30H41N5O2
Mol. Mass.:
503.6788
SMILES:
CCC(=O)N1CCC(CC1)C(CCN1C[C@H]2CN(C[C@H]2C1)C(=O)c1c(C)ncnc1C)c1ccccc1
: