Target
C-C motif chemokine 5
Ligand
BDBM50329239
Substrate
Meas. Tech.
ChEMBL_675123 (CHEMBL1272914)
IC50
207±n/a nM
Citation
 Wanner, JChen, LLemoine, RCKondru, RJekle, AHeilek, GdeRosier, AJi, CBerry, PWRotstein, DM Evaluation of amide replacements in CCR5 antagonists as a means to increase intrinsic permeability. Part 2: SAR optimization and pharmacokinetic profile of a homologous azacyle series. Bioorg Med Chem Lett 20:6802-7 (2010)  
Target
Name:
C-C motif chemokine 5
Synonyms:
CCL5 D17S136E Eosinophil chemotactic cytokine RANTES(4-68) SIS-delta T cell-specific protein P228 TCP228
Type:
PROTEIN
Mol. Mass.:
9996.11
Organism:
Homo sapiens (Human)
Description:
ChEMBL_1363187
Residue:
91
  
Inhibitor
Name:
BDBM50329239
Synonyms:
((3aR,6aS)-5-(3-(1-(cyclopentanecarbonyl)azetidin-3-yl)-3-phenylpropyl)hexahydropyrrolo[3,4-c]pyrrol-2(1H)-yl)(4,6-dimethylpyrimidin-5-yl)methanone | CHEMBL1269884
Type:
Small organic molecule
Emp. Form.:
C31H41N5O2
Mol. Mass.:
515.6895
SMILES:
Cc1ncnc(C)c1C(=O)N1C[C@@H]2CN(CCC(C3CN(C3)C(=O)C3CCCC3)c3ccccc3)C[C@@H]2C1
: