Target
C-C motif chemokine 5
Ligand
BDBM50329247
Substrate
Meas. Tech.
ChEMBL_675123 (CHEMBL1272914)
IC50
48±n/a nM
Citation
 Wanner, JChen, LLemoine, RCKondru, RJekle, AHeilek, GdeRosier, AJi, CBerry, PWRotstein, DM Evaluation of amide replacements in CCR5 antagonists as a means to increase intrinsic permeability. Part 2: SAR optimization and pharmacokinetic profile of a homologous azacyle series. Bioorg Med Chem Lett 20:6802-7 (2010)  
Target
Name:
C-C motif chemokine 5
Synonyms:
CCL5 D17S136E Eosinophil chemotactic cytokine RANTES(4-68) SIS-delta T cell-specific protein P228 TCP228
Type:
PROTEIN
Mol. Mass.:
9996.11
Organism:
Homo sapiens (Human)
Description:
ChEMBL_1363187
Residue:
91
  
Inhibitor
Name:
BDBM50329247
Synonyms:
(4,6-dimethylpyrimidin-5-yl)((3aR,6aS)-5-(3-phenyl-3-(1-(2,2,2-trifluoroethylsulfonyl)piperidin-4-yl)propyl)hexahydropyrrolo[3,4-c]pyrrol-2(1H)-yl)methanone | CHEMBL1269383
Type:
Small organic molecule
Emp. Form.:
C29H38F3N5O3S
Mol. Mass.:
593.704
SMILES:
Cc1ncnc(C)c1C(=O)N1C[C@@H]2CN(CCC(C3CCN(CC3)S(=O)(=O)CC(F)(F)F)c3ccccc3)C[C@@H]2C1
: