Target
Lethal factor
Ligand
BDBM50329263
Substrate
Meas. Tech.
ChEMBL_675361 (CHEMBL1273398)
Ki
0.69±n/a nM
Citation
 Jiao, GSKim, SMoayeri, MCregar-Hernandez, LMcKasson, LMargosiak, SALeppla, SHJohnson, AT Antidotes to anthrax lethal factor intoxication. Part 1: Discovery of potent lethal factor inhibitors with in vivo efficacy. Bioorg Med Chem Lett 20:6850-3 (2010)  
Target
Name:
Lethal factor
Synonyms:
Anthrax Lethal Factor (LF) Antrax lethal toxin lef | lethal factor
Type:
PROTEIN
Mol. Mass.:
93758.56
Organism:
Bacillus anthracis
Description:
ChEMBL_1460338
Residue:
809
  
Inhibitor
Name:
BDBM50329263
Synonyms:
(R)-2-(4-fluoro-3,5-dimethylphenylamino)-6-(2-fluorobenzylamino)-N-hydroxyhexanamide | CHEMBL1269887
Type:
Small organic molecule
Emp. Form.:
C21H27F2N3O2
Mol. Mass.:
391.4548
SMILES:
Cc1cc(N[C@H](CCCCNCc2ccccc2F)C(=O)NO)cc(C)c1F
: