Target
Lethal factor
Ligand
BDBM50329267
Substrate
Meas. Tech.
ChEMBL_675361 (CHEMBL1273398)
Ki
0.41±n/a nM
Citation
 Jiao, GSKim, SMoayeri, MCregar-Hernandez, LMcKasson, LMargosiak, SALeppla, SHJohnson, AT Antidotes to anthrax lethal factor intoxication. Part 1: Discovery of potent lethal factor inhibitors with in vivo efficacy. Bioorg Med Chem Lett 20:6850-3 (2010)  
Target
Name:
Lethal factor
Synonyms:
Anthrax Lethal Factor (LF) Antrax lethal toxin lef | lethal factor
Type:
PROTEIN
Mol. Mass.:
93758.56
Organism:
Bacillus anthracis
Description:
ChEMBL_1460338
Residue:
809
  
Inhibitor
Name:
BDBM50329267
Synonyms:
(R)-2-(4-fluoro-3,5-dimethylphenylamino)-N-hydroxy-6-(4-methylbenzylamino)hexanamide | CHEMBL1270103
Type:
Small organic molecule
Emp. Form.:
C22H30FN3O2
Mol. Mass.:
387.4909
SMILES:
Cc1ccc(CNCCCC[C@@H](Nc2cc(C)c(F)c(C)c2)C(=O)NO)cc1
: