Target
Lethal factor
Ligand
BDBM50329273
Substrate
Meas. Tech.
ChEMBL_675361 (CHEMBL1273398)
Ki
1.3±n/a nM
Citation
 Jiao, GSKim, SMoayeri, MCregar-Hernandez, LMcKasson, LMargosiak, SALeppla, SHJohnson, AT Antidotes to anthrax lethal factor intoxication. Part 1: Discovery of potent lethal factor inhibitors with in vivo efficacy. Bioorg Med Chem Lett 20:6850-3 (2010)  
Target
Name:
Lethal factor
Synonyms:
Anthrax Lethal Factor (LF) Antrax lethal toxin lef | lethal factor
Type:
PROTEIN
Mol. Mass.:
93758.56
Organism:
Bacillus anthracis
Description:
ChEMBL_1460338
Residue:
809
  
Inhibitor
Name:
BDBM50329273
Synonyms:
(R)-2-(4-fluoro-3,5-dimethylphenylamino)-6-(3-(4-fluorophenyl)propylamino)-N-hydroxyhexanamide | CHEMBL1270404
Type:
Small organic molecule
Emp. Form.:
C23H31F2N3O2
Mol. Mass.:
419.5079
SMILES:
Cc1cc(N[C@H](CCCCNCCCc2ccc(F)cc2)C(=O)NO)cc(C)c1F
: