Target
Beta-secretase 2
Ligand
BDBM50329521
Substrate
Meas. Tech.
ChEMBL_674723 (CHEMBL1273976)
IC50
2680±n/a nM
Citation
 Malamas, MSRobichaud, AErdei, JQuagliato, DSolvibile, WZhou, PMorris, KTurner, JWagner, EFan, KOlland, AJacobsen, SReinhart, PRiddell, DPangalos, M Design and synthesis of aminohydantoins as potent and selective humanß-secretase (BACE1) inhibitors with enhanced brain permeability. Bioorg Med Chem Lett 20:6597-605 (2010)  
Target
Name:
Beta-secretase 2
Synonyms:
AEPLC ASP1 Asp 1 Aspartyl protease 1 BACE2_HUMAN Beta-secretase (BACE) Beta-secretase 2 (BACE-2) Beta-site APP-cleaving enzyme 2 Memapsin-1 beta-Secretase (BACE-2)
Type:
Protein
Mol. Mass.:
56171.20
Organism:
Homo sapiens (Human)
Description:
Q9Y5Z0
Residue:
518
  
Inhibitor
Name:
BDBM50329521
Synonyms:
(S)-2-amino-1-methyl-4-phenyl-4-(4-(trifluoromethoxy)phenyl)-1H-imidazol-5(4H)-one | CHEMBL1271451
Type:
Small organic molecule
Emp. Form.:
C17H14F3N3O2
Mol. Mass.:
349.3072
SMILES:
CN1C(N)=N[C@@](C1=O)(c1ccccc1)c1ccc(OC(F)(F)F)cc1
: