Target
Lysosomal acid glucosylceramidase
Ligand
BDBM50329780
Substrate
Meas. Tech.
ChEMBL_674763 (CHEMBL1274071)
Ki
32000±n/a nM
Citation
 Aguilar-Moncayo, MGarcía-Moreno, MIStütz, AEGarcía Fernández, JMWrodnigg, TMOrtiz Mellet, C Fluorescent-tagged sp2-iminosugars with potentß-glucosidase inhibitory activity. Bioorg Med Chem 18:7439-45 (2010)  
Target
Name:
Lysosomal acid glucosylceramidase
Synonyms:
Acid beta-glucosidase GBA GBA1_BOVIN | Glucosylceramidase
Type:
PROTEIN
Mol. Mass.:
59862.93
Organism:
Bos taurus
Description:
ChEMBL_1460504
Residue:
536
  
Inhibitor
Name:
BDBM50329780
Synonyms:
5-N,6-S-[N'-[4-(6-Dansylaminohexanamido)butyl]iminomethylidene]-6-thionojirimycin | CHEMBL1269790
Type:
Small organic molecule
Emp. Form.:
C28H43N5O8S3
Mol. Mass.:
673.865
SMILES:
CN(C)c1cccc2c(cccc12)S(=O)(=O)NCCCCCS(=O)(=O)NCCCC\N=C1/SC[C@@H]2[C@@H](O)[C@H](O)[C@@H](O)[C@@H](O)N12
: