Target
Lysosomal acid glucosylceramidase
Ligand
BDBM50329781
Substrate
Meas. Tech.
ChEMBL_674763 (CHEMBL1274071)
Ki
32000±n/a nM
Citation
 Aguilar-Moncayo, MGarcía-Moreno, MIStütz, AEGarcía Fernández, JMWrodnigg, TMOrtiz Mellet, C Fluorescent-tagged sp2-iminosugars with potentß-glucosidase inhibitory activity. Bioorg Med Chem 18:7439-45 (2010)  
Target
Name:
Lysosomal acid glucosylceramidase
Synonyms:
Acid beta-glucosidase GBA GBA1_BOVIN | Glucosylceramidase
Type:
PROTEIN
Mol. Mass.:
59862.93
Organism:
Bos taurus
Description:
ChEMBL_1460504
Residue:
536
  
Inhibitor
Name:
BDBM50329781
Synonyms:
5-N,6-S-[N'-[4-(7'-Diethylaminocoumarin-30-ylcarboxamido)butyl]iminomethylidene]-6-thionojirimycin | CHEMBL1272019
Type:
Small organic molecule
Emp. Form.:
C24H34N4O8S2
Mol. Mass.:
570.679
SMILES:
CCN(CC)c1ccc2cc(c(=O)oc2c1)S(=O)(=O)NCCCC\N=C1/SC[C@@H]2[C@@H](O)[C@H](O)[C@@H](O)[C@@H](O)N12
: