Target
Carbonic anhydrase 2
Ligand
BDBM50329834
Substrate
Meas. Tech.
ChEMBL_675713 (CHEMBL1272347)
Kd
20±n/a nM
Citation
 Capkauskaite, EBaranauskiene, LGolovenko, DManakova, EGražulis, STumkevičius, SMatulis, D Indapamide-like benzenesulfonamides as inhibitors of carbonic anhydrases I, II, VII, and XIII. Bioorg Med Chem 18:7357-64 (2010)  
Target
Name:
Carbonic anhydrase 2
Synonyms:
CA-II CAC Carbonate dehydratase II Carbonic anhydrase 2 (CA-II) Carbonic anhydrase C Carbonic anhydrase II (CA-II) Carbonic anhydrase II (hCA II) | Carbonic anhydrase isoenzyme II (hCA II)
Type:
Enzyme
Mol. Mass.:
29250.71
Organism:
Homo sapiens (Human)
Description:
P00918
Residue:
260
  
Inhibitor
Name:
BDBM50329834
Synonyms:
2-Chloro-5-[(6,7-dihydro-1H-[1,4]dioxino[2,3-f]benzimidazol-2-ylsulfanyl)acetyl]ben-zenesulfonamide CHEMBL1232443
Type:
Small organic molecule
Emp. Form.:
C17H14ClN3O5S2
Mol. Mass.:
439.893
SMILES:
NS(=O)(=O)c1cc(ccc1Cl)C(=O)CSc1nc2cc3OCCOc3cc2[nH]1
: