Target
Tyrosine-protein kinase Lck
Ligand
BDBM50329879
Substrate
Meas. Tech.
ChEMBL_675750 (CHEMBL1272384)
IC50
430±n/a nM
Citation
 Machrouhi, FOuhamou, NLaderoute, KCalaoagan, JBukhtiyarova, MEhrlich, PJKlon, AE The rational design of a novel potent analogue of the 5'-AMP-activated protein kinase inhibitor compound C with improved selectivity and cellular activity. Bioorg Med Chem Lett 20:6394-9 (2010)  
Target
Name:
Tyrosine-protein kinase Lck
Synonyms:
2.7.10.2 LCK_HUMAN Leukocyte C-terminal Src kinase Lymphocyte-specific protein tyrosine kinase Protein YT16 Proto-oncogene tyrosine-protein kinase LCK T cell-specific protein-tyrosine kinase
Type:
Mol. Mass.:
57987.83
Organism:
Homo sapiens (Human)
Description:
P06239
Residue:
509
  
Inhibitor
Name:
BDBM50329879
Synonyms:
5-(6-(4-(2-morpholinoethoxy)phenyl)pyrazolo[1,5-a]pyrimidin-3-yl)pyridin-2(1H)-one | CHEMBL1271480
Type:
Small organic molecule
Emp. Form.:
C23H23N5O3
Mol. Mass.:
417.4604
SMILES:
O=c1ccc(c[nH]1)-c1cnn2cc(cnc12)-c1ccc(OCCN2CCOCC2)cc1
: