Target
Hypoxia-inducible factor 1-alpha
Ligand
BDBM50329892
Substrate
Meas. Tech.
ChEMBL_675859 (CHEMBL1272617)
IC50
5500±n/a nM
Citation
 Yewalkar, NDeore, VPadgaonkar, AManohar, SSahu, BKumar, PJalota-Badhwar, AJoshi, KSSharma, SKumar, S Development of novel inhibitors targeting HIF-1a towards anticancer drug discovery. Bioorg Med Chem Lett 20:6426-9 (2010)  
Target
Name:
Hypoxia-inducible factor 1-alpha
Synonyms:
BHLHE78 HIF-1-alpha, HIF-2-alpha HIF1A_HUMAN Hypoxia-inducible factor 1 alpha MOP1 von Hippel-Lindau disease tumor suppressor/Elongin-C/Elongin-B/HIF1A
Type:
Protein
Mol. Mass.:
92647.24
Organism:
Homo sapiens (Human)
Description:
Q16665
Residue:
826
  
Inhibitor
Name:
BDBM50329892
Synonyms:
2-chloro-N-(6-(4-(chloromethyl)-6-hydroxypyrimidin-2-yl)pyridin-3-yl)acetamide | CHEMBL1269467
Type:
Small organic molecule
Emp. Form.:
C12H10Cl2N4O2
Mol. Mass.:
313.139
SMILES:
ClCC(=O)Nc1ccc(nc1)-c1nc(CCl)cc(=O)[nH]1
: