Target
Hypoxia-inducible factor 1-alpha
Ligand
BDBM50329894
Substrate
Meas. Tech.
ChEMBL_675858 (CHEMBL1272616)
IC50
2000±n/a nM
Citation
 Yewalkar, NDeore, VPadgaonkar, AManohar, SSahu, BKumar, PJalota-Badhwar, AJoshi, KSSharma, SKumar, S Development of novel inhibitors targeting HIF-1a towards anticancer drug discovery. Bioorg Med Chem Lett 20:6426-9 (2010)  
Target
Name:
Hypoxia-inducible factor 1-alpha
Synonyms:
BHLHE78 HIF-1-alpha, HIF-2-alpha HIF1A_HUMAN Hypoxia-inducible factor 1 alpha MOP1 von Hippel-Lindau disease tumor suppressor/Elongin-C/Elongin-B/HIF1A
Type:
Protein
Mol. Mass.:
92647.24
Organism:
Homo sapiens (Human)
Description:
Q16665
Residue:
826
  
Inhibitor
Name:
BDBM50329894
Synonyms:
2-chloro-N-(6-(5-fluoro-4-hydroxy-6-methylpyrimidin-2-yl)pyridin-3-yl)acetamide | CHEMBL1269016
Type:
Small organic molecule
Emp. Form.:
C12H10ClFN4O2
Mol. Mass.:
296.685
SMILES:
Cc1nc([nH]c(=O)c1F)-c1ccc(NC(=O)CCl)cn1
: