Target
Stearoyl-CoA desaturase 5
Ligand
BDBM50329977
Substrate
Meas. Tech.
ChEMBL_676022 (CHEMBL1272960)
IC50
>20000±n/a nM
Citation
 Powell, DARamtohul, YLebrun, MEOballa, RBhat, SFalgueyret, JPGuiral, SHuang, ZSkorey, KTawa, PZhang, L 2-Aryl benzimidazoles: human SCD1-specific stearoyl coenzyme-A desaturase inhibitors. Bioorg Med Chem Lett 20:6366-9 (2010)  
Target
Name:
Stearoyl-CoA desaturase 5
Synonyms:
ACOD4 HSCD5 SCD4 SCD5_HUMAN | Stearoyl-CoA 9-desaturase
Type:
PROTEIN
Mol. Mass.:
37630.07
Organism:
Homo sapiens (Human)
Description:
ChEMBL_805311
Residue:
330
  
Inhibitor
Name:
BDBM50329977
Synonyms:
2-(4-(furan-3-yl)phenyl)-6-(methylsulfonyl)-1H-benzo[d]imidazole | CHEMBL1271986
Type:
Small organic molecule
Emp. Form.:
C18H14N2O3S
Mol. Mass.:
338.38
SMILES:
CS(=O)(=O)c1ccc2nc([nH]c2c1)-c1ccc(cc1)-c1ccoc1
: