Target
Cytochrome P450 3A4
Ligand
BDBM50330023
Substrate
Meas. Tech.
ChEMBL_676065 (CHEMBL1273059)
IC50
1.4±n/a nM
Citation
 Li, HXu, RCole, DClader, JWGreenlee, WJNomeir, AASong, LZhang, L Design, synthesis, and structure-activity relationship studies of N-arylsulfonyl morpholines as¿-secretase inhibitors. Bioorg Med Chem Lett 20:6606-9 (2010)  
Target
Name:
Cytochrome P450 3A4
Synonyms:
Albendazole monooxygenase CP3A4_HUMAN CYP3A4 CYPIIIA4 Cytochrome P450 3A4 (CYP3A4) Nifedipine oxidase Taurochenodeoxycholate 6-alpha-hydroxylase
Type:
Enzyme
Mol. Mass.:
57349.57
Organism:
Homo sapiens (Human)
Description:
Residue:
503
  
Inhibitor
Name:
BDBM50330023
Synonyms:
1-((3R,5R)-4-(4-chlorophenylsulfonyl)-5-(cyclopropylmethyl)morpholin-3-yl)cyclopropyl 4-methyl-3-oxopiperazine-1-carboxylate | CHEMBL1272097
Type:
Small organic molecule
Emp. Form.:
C23H30ClN3O6S
Mol. Mass.:
512.019
SMILES:
CN1CCN(CC1=O)C(=O)OC1(CC1)[C@H]1COC[C@@H](CC2CC2)N1S(=O)(=O)c1ccc(Cl)cc1
: