Target
Cathepsin B
Ligand
BDBM50330031
Substrate
Meas. Tech.
ChEMBL_676070 (CHEMBL1273064)
IC50
1600±n/a nM
Citation
 Kumar, GDChavarria, GECharlton-Sevcik, AKYoo, GKSong, JStrecker, TESiim, BGChaplin, DJTrawick, MLPinney, KG Functionalized benzophenone, thiophene, pyridine, and fluorene thiosemicarbazone derivatives as inhibitors of cathepsin L. Bioorg Med Chem Lett 20:6610-5 (2010)  
Target
Name:
Cathepsin B
Synonyms:
APP secretase CATB_HUMAN CTSB Cathepsin B light chain | Cathepsin B1
Type:
Enzyme
Mol. Mass.:
37819.69
Organism:
Homo sapiens (Human)
Description:
gi_63102437
Residue:
339
  
Inhibitor
Name:
BDBM50330031
Synonyms:
CHEMBL1272261 | [(3-Bromophenyl)-(3-acetoxyphenyl)-ketone]thiosemicarbazone
Type:
Small organic molecule
Emp. Form.:
C16H14BrN3O2S
Mol. Mass.:
392.27
SMILES:
CC(=O)Oc1cccc(c1)C(=NNC(N)=S)c1cccc(Br)c1
: