Target
Induced myeloid leukemia cell differentiation protein Mcl-1
Ligand
BDBM50330250
Substrate
Meas. Tech.
ChEMBL_676278 (CHEMBL1273519)
Ki
160±n/a nM
Citation
 Wei, JKitada, SStebbins, JLPlaczek, WZhai, DWu, BRega, MFZhang, ZCellitti, JYang, LDahl, RReed, JCPellecchia, M Synthesis and biological evaluation of Apogossypolone derivatives as pan-active inhibitors of antiapoptotic B-cell lymphoma/leukemia-2 (Bcl-2) family proteins. J Med Chem 53:8000-11 (2010)  
Target
Name:
Induced myeloid leukemia cell differentiation protein Mcl-1
Synonyms:
BCL2L3 Bcl-2-like protein 3 (Mcl-1) Bcl2-L-3 MCL1 Mcl-1 Myeloid cell leukemia sequence 1 (BCL2-related) | mcl1/EAT
Type:
Membrane; Single-pass membrane protein
Mol. Mass.:
37332.87
Organism:
Homo sapiens (Human)
Description:
Q07820
Residue:
350
  
Inhibitor
Name:
BDBM50330250
Synonyms:
5,5'-Dibenzyl-6,6',7,7'-tetrahydroxy-3,3'-dimethyl-2,2'-binaphthyl-1,1',4,4'-tetraone | CHEMBL1269107
Type:
Small organic molecule
Emp. Form.:
C36H26O8
Mol. Mass.:
586.5868
SMILES:
Oc1cc2c(O)c(-c3c(O)c4cc(O)c(O)c(=Cc5ccccc5)c4c(O)c3=C)c(=C)c(O)c2c(=Cc2ccccc2)c1O
: