Target
Bcl-2-related protein A1
Ligand
BDBM50330255
Substrate
Meas. Tech.
ChEMBL_676277 (CHEMBL1273518)
Ki
3530±n/a nM
Citation
 Wei, JKitada, SStebbins, JLPlaczek, WZhai, DWu, BRega, MFZhang, ZCellitti, JYang, LDahl, RReed, JCPellecchia, M Synthesis and biological evaluation of Apogossypolone derivatives as pan-active inhibitors of antiapoptotic B-cell lymphoma/leukemia-2 (Bcl-2) family proteins. J Med Chem 53:8000-11 (2010)  
Target
Name:
Bcl-2-related protein A1
Synonyms:
B2LA1_HUMAN BCL2L5 Bcl-2-like protein 5 HBPA1 Protein BFL-1 | Protein GRS
Type:
Apoptosis regulator protein
Mol. Mass.:
20130.01
Organism:
Homo sapiens (Human)
Description:
Residue:
175
  
Inhibitor
Name:
BDBM50330255
Synonyms:
6,6',7,7'-Tetrahydroxy-3,3'-dimethyl-5,5'-bis(3-phenylpropyl)-2,2'-binaphthyl-1,1',4,4'-tetraone | CHEMBL1269077
Type:
Small organic molecule
Emp. Form.:
C40H34O8
Mol. Mass.:
642.6932
SMILES:
Oc1cc2c(O)c(-c3c(O)c4cc(O)c(O)c(=CCCc5ccccc5)c4c(O)c3=C)c(=C)c(O)c2c(=CCCc2ccccc2)c1O
: