Target
Bcl-2-related protein A1
Ligand
BDBM50330251
Substrate
Meas. Tech.
ChEMBL_676277 (CHEMBL1273518)
Ki
870±n/a nM
Citation
 Wei, JKitada, SStebbins, JLPlaczek, WZhai, DWu, BRega, MFZhang, ZCellitti, JYang, LDahl, RReed, JCPellecchia, M Synthesis and biological evaluation of Apogossypolone derivatives as pan-active inhibitors of antiapoptotic B-cell lymphoma/leukemia-2 (Bcl-2) family proteins. J Med Chem 53:8000-11 (2010)  
Target
Name:
Bcl-2-related protein A1
Synonyms:
B2LA1_HUMAN BCL2L5 Bcl-2-like protein 5 HBPA1 Protein BFL-1 | Protein GRS
Type:
Apoptosis regulator protein
Mol. Mass.:
20130.01
Organism:
Homo sapiens (Human)
Description:
Residue:
175
  
Inhibitor
Name:
BDBM50330251
Synonyms:
CHEMBL1269012 | N5,N5'-Bis(4-ethylphenethyl)-6,6',7,7'-tetrahydroxy-3,3'-dimethyl-1,1',4,4'-tetraoxo-1,1',4,4'-tetrahydro-2,2'-binaphthyl-5,5'-dicarboxamide
Type:
Small organic molecule
Emp. Form.:
C44H40N2O10
Mol. Mass.:
756.7958
SMILES:
CCc1ccc(CCNC(=O)c2c(O)c(O)cc3C(=O)C(=C(C)C(=O)c23)C2=C(C)C(=O)c3c(cc(O)c(O)c3C(=O)NCCc3ccc(CC)cc3)C2=O)cc1
: