Target
Bcl-2-like protein 1
Ligand
BDBM50330249
Substrate
Meas. Tech.
ChEMBL_676275 (CHEMBL1273516)
IC50
3100±n/a nM
Citation
 Wei, JKitada, SStebbins, JLPlaczek, WZhai, DWu, BRega, MFZhang, ZCellitti, JYang, LDahl, RReed, JCPellecchia, M Synthesis and biological evaluation of Apogossypolone derivatives as pan-active inhibitors of antiapoptotic B-cell lymphoma/leukemia-2 (Bcl-2) family proteins. J Med Chem 53:8000-11 (2010)  
Target
Name:
Bcl-2-like protein 1
Synonyms:
Anti-apoptotic Bcl-2 protein Apoptosis regulator Bcl-X BCL2-like 1 isoform 1 BCL2L1 Bcl-2-like protein 1 (Bcl-XL) Bcl-xL/Bcl-2-binding component 3 Bcl2-antagonist of cell death (BAD)
Type:
Mitochondrion membrane; Single-pass membrane protein
Mol. Mass.:
26039.60
Organism:
Homo sapiens (Human)
Description:
Residue:
233
  
Inhibitor
Name:
BDBM50330249
Synonyms:
6,6',7,7'-Tetrahydroxy-3,3'-dimethyl-5,5'-bis(4-methylphenethyl)-2,2'-binaphthyl-1,1',4,4'-tetraone | CHEMBL1269076
Type:
Small organic molecule
Emp. Form.:
C40H34O8
Mol. Mass.:
642.6932
SMILES:
Cc1ccc(CC=c2c(O)c(O)cc3c(O)c(-c4c(O)c5cc(O)c(O)c(=CCc6ccc(C)cc6)c5c(O)c4=C)c(=C)c(O)c23)cc1
: