Target
DNA gyrase subunit B
Ligand
BDBM50330293
Substrate
Meas. Tech.
ChEMBL_677264 (CHEMBL1279102)
IC50
460±n/a nM
Citation
 Anderle, CStieger, MBurrell, MReinelt, SMaxwell, APage, MHeide, L Biological activities of novel gyrase inhibitors of the aminocoumarin class. Antimicrob Agents Chemother 52:1982-90 (2008)  
Target
Name:
DNA gyrase subunit B
Synonyms:
DNA gyrase subunit B GYRB_ECOLI acrB gyrB hisU parA | pcbA
Type:
Enzyme Subunit
Mol. Mass.:
89941.28
Organism:
Escherichia coli (strain K12)
Description:
P0AES6
Residue:
804
  
Inhibitor
Name:
BDBM50330293
Synonyms:
(2S,3R,4R,5R)-2-(8-chloro-4-hydroxy-3-(4-hydroxy-3-methoxybenzamido)-2-oxo-2H-chromen-7-yloxy)-4-hydroxy-5-methoxy-6,6-dimethyltetrahydro-2H-pyran-3-yl 5-methyl-1H-pyrrole-2-carboxylate | CHEMBL1275899
Type:
Small organic molecule
Emp. Form.:
C31H31ClN2O12
Mol. Mass.:
659.037
SMILES:
CO[C@@H]1[C@@H](O)[C@@H](OC(=O)c2ccc(C)[nH]2)[C@H](Oc2ccc3c(O)c(NC(=O)c4ccc(O)c(OC)c4)c(=O)oc3c2Cl)OC1(C)C
: