Target
VIM-1 protein
Ligand
BDBM50092158
Substrate
Meas. Tech.
ChEMBL_678224 (CHEMBL1280219)
IC50
73000±n/a nM
Citation
 Juan, CBeceiro, AGutiérrez, OAlbertí, SGarau, MPérez, JLBou, GOliver, A Characterization of the new metallo-beta-lactamase VIM-13 and its integron-borne gene from a Pseudomonas aeruginosa clinical isolate in Spain. Antimicrob Agents Chemother 52:3589-96 (2008)  
Target
Name:
VIM-1 protein
Synonyms:
Beta-lactamase VIM-1 Metallo-beta-lactamase VIM-1 VIM-1 VIM-1 metallo-beta-lactamase | VIM-1 protein
Type:
Enzyme Catalytic Domain
Mol. Mass.:
28014.53
Organism:
Pseudomonas aeruginosa
Description:
Residue:
266
  
Inhibitor
Name:
BDBM50092158
Synonyms:
1,10-phenanthroline US10669227, Compound 1,10-phenanthroline US9187406, 1,10-phenanthroline | cid_1318
Type:
Small organic molecule
Emp. Form.:
C12H8N2
Mol. Mass.:
180.2053
SMILES:
c1cnc2c(c1)ccc1cccnc21
: