Target
Aldo-keto reductase family 1 member C2
Ligand
BDBM50330425
Substrate
Meas. Tech.
ChEMBL_684684 (CHEMBL1285651)
Ki
168±n/a nM
Citation
 El-Kabbani, OScammells, PJDay, TDhagat, UEndo, SMatsunaga, TSoda, MHara, A Structure-based optimization and biological evaluation of human 20a-hydroxysteroid dehydrogenase (AKR1C1) salicylic acid-based inhibitors. Eur J Med Chem 45:5309-17 (2010)  
Target
Name:
Aldo-keto reductase family 1 member C2
Synonyms:
3-alpha-HSD3 AK1C2_HUMAN Aldo-keto reductase family 1 member C2 (AK1C2) Aldo-keto reductase family 1 member C2 (AKR1C2) DD-2 DDH2 Dihydrodiol dehydrogenase/bile acid-binding protein Type III 3-alpha-hydroxysteroid dehydrogenase
Type:
Enzyme
Mol. Mass.:
36739.89
Organism:
Homo sapiens (Human)
Description:
Residue:
323
  
Inhibitor
Name:
BDBM50330425
Synonyms:
3-chloro-2-hydroxy-5-(phenylethynyl)benzoic acid | CHEMBL1275724
Type:
Small organic molecule
Emp. Form.:
C15H9ClO3
Mol. Mass.:
272.683
SMILES:
OC(=O)c1cc(cc(Cl)c1O)C#Cc1ccccc1
: