Target
Kinesin-like protein KIF11
Ligand
BDBM50330550
Substrate
Meas. Tech.
ChEMBL_685005 (CHEMBL1286523)
IC50
180±n/a nM
Citation
 Fu, RGYou, QDYang, LWu, WTJiang, CXu, XL Design, synthesis and bioevaluation of dihydropyrazolo[3,4-b]pyridine and benzo[4,5]imidazo[1,2-a]pyrimidine compounds as dual KSP and Aurora-A kinase inhibitors for anti-cancer agents. Bioorg Med Chem 18:8035-43 (2010)  
Target
Name:
Kinesin-like protein KIF11
Synonyms:
EG5 KIF11_HUMAN Kinesin Spindle Protein Eg5 TRIP5 | kinesin spindle protein
Type:
PROTEIN
Mol. Mass.:
119138.97
Organism:
Homo sapiens (Human)
Description:
ChEMBL_1457426
Residue:
1056
  
Inhibitor
Name:
BDBM50330550
Synonyms:
CHEMBL1277474 | N-(4-chlorophenyl)-2,7,7-trimethyl-5-oxo-4-phenyl-1,4,5,6,7,8-hexahydroquinoline-3-carboxamide
Type:
Small organic molecule
Emp. Form.:
C25H25ClN2O2
Mol. Mass.:
420.931
SMILES:
CC1=C(C(C2C(=O)CC(C)(C)CC2=N1)c1ccccc1)C(=O)Nc1ccc(Cl)cc1
: