Target
Kinesin-like protein KIF11
Ligand
BDBM50330551
Substrate
Meas. Tech.
ChEMBL_685005 (CHEMBL1286523)
IC50
200±n/a nM
Citation
 Fu, RGYou, QDYang, LWu, WTJiang, CXu, XL Design, synthesis and bioevaluation of dihydropyrazolo[3,4-b]pyridine and benzo[4,5]imidazo[1,2-a]pyrimidine compounds as dual KSP and Aurora-A kinase inhibitors for anti-cancer agents. Bioorg Med Chem 18:8035-43 (2010)  
Target
Name:
Kinesin-like protein KIF11
Synonyms:
EG5 KIF11_HUMAN Kinesin Spindle Protein Eg5 TRIP5 | kinesin spindle protein
Type:
PROTEIN
Mol. Mass.:
119138.97
Organism:
Homo sapiens (Human)
Description:
ChEMBL_1457426
Residue:
1056
  
Inhibitor
Name:
BDBM50330551
Synonyms:
4-Phenyl-6-methyl-N-(4-nitrophenyl)-4,7-dihydro-2Hpyrazole[3,4-b]pyridine-5-carboxamide | CHEMBL1278186
Type:
Small organic molecule
Emp. Form.:
C20H17N5O3
Mol. Mass.:
375.3807
SMILES:
CC1=Nc2[nH]ncc2C(C1C(=O)Nc1ccc(cc1)[N+]([O-])=O)c1ccccc1
: