Target
Aurora kinase A
Ligand
BDBM50224731
Substrate
Meas. Tech.
ChEMBL_685006 (CHEMBL1286524)
IC50
4970±n/a nM
Citation
 Fu, RGYou, QDYang, LWu, WTJiang, CXu, XL Design, synthesis and bioevaluation of dihydropyrazolo[3,4-b]pyridine and benzo[4,5]imidazo[1,2-a]pyrimidine compounds as dual KSP and Aurora-A kinase inhibitors for anti-cancer agents. Bioorg Med Chem 18:8035-43 (2010)  
Target
Name:
Aurora kinase A
Synonyms:
AIK ARK-1 AURA AURKA_HUMAN Aurora 2 Aurora kinase A (AURKA) Aurora kinase A (Aurora-2) Aurora/IPL1-related kinase 1 Breast tumor-amplified kinase IAK1 STK15 GN Serine/threonine kinase 15 Serine/threonine-protein kinase 6 Serine/threonine-protein kinase aurora-A aurora-2 | hARK1
Type:
Serine/threonine-protein kinase
Mol. Mass.:
45830.98
Organism:
Homo sapiens (Human)
Description:
O14965
Residue:
403
  
Inhibitor
Name:
BDBM50224731
Synonyms:
4-(6-chloro-3H-imidazo[4,5-b]pyridin-2-yl)-N,N-dimethylbenzenamine | CHEMBL236694
Type:
Small organic molecule
Emp. Form.:
C14H13ClN4
Mol. Mass.:
272.733
SMILES:
CN(C)c1ccc(cc1)-c1nc2ncc(Cl)cc2[nH]1
: