Target
Aurora kinase A
Ligand
BDBM50330557
Substrate
Meas. Tech.
ChEMBL_685006 (CHEMBL1286524)
IC50
5730±n/a nM
Citation
 Fu, RGYou, QDYang, LWu, WTJiang, CXu, XL Design, synthesis and bioevaluation of dihydropyrazolo[3,4-b]pyridine and benzo[4,5]imidazo[1,2-a]pyrimidine compounds as dual KSP and Aurora-A kinase inhibitors for anti-cancer agents. Bioorg Med Chem 18:8035-43 (2010)  
Target
Name:
Aurora kinase A
Synonyms:
AIK ARK1 AURKA AYK1 Aurora kinase A (AURA) Aurora kinase A (Aurora A) Aurora-related kinase 1 BTAK Breast-tumor-amplified kinase STK15 Serine/threonine kinase 15 Serine/threonine-protein kinase aurora A hARK1
Type:
Serine/threonine-protein kinase
Mol. Mass.:
45830.98
Organism:
Homo sapiens (Human)
Description:
O14965
Residue:
403
  
Inhibitor
Name:
BDBM50330557
Synonyms:
CHEMBL1277383 | N-(3-Chloro-4-fluorobenzyl)-4-furan-2-methyl-1,4-dihydrobenzo[4,5]imidazo[1,2-a]pyrimidine-3-carboxamide
Type:
Small organic molecule
Emp. Form.:
C22H16ClFN4O2
Mol. Mass.:
422.839
SMILES:
CC1=Nc2nc3ccccc3n2C(C1C(=O)Nc1ccc(F)c(Cl)c1)c1ccco1
: