Target
Aurora kinase A
Ligand
BDBM50330556
Substrate
Meas. Tech.
ChEMBL_685006 (CHEMBL1286524)
IC50
>50000±n/a nM
Citation
 Fu, RGYou, QDYang, LWu, WTJiang, CXu, XL Design, synthesis and bioevaluation of dihydropyrazolo[3,4-b]pyridine and benzo[4,5]imidazo[1,2-a]pyrimidine compounds as dual KSP and Aurora-A kinase inhibitors for anti-cancer agents. Bioorg Med Chem 18:8035-43 (2010)  
Target
Name:
Aurora kinase A
Synonyms:
AIK ARK1 AURKA AYK1 Aurora kinase A (AURA) Aurora kinase A (Aurora A) Aurora-related kinase 1 BTAK Breast-tumor-amplified kinase STK15 Serine/threonine kinase 15 Serine/threonine-protein kinase aurora A hARK1
Type:
Serine/threonine-protein kinase
Mol. Mass.:
45830.98
Organism:
Homo sapiens (Human)
Description:
O14965
Residue:
403
  
Inhibitor
Name:
BDBM50330556
Synonyms:
4-Thiophene-6-methyl-N-(4-nitrophenyl)-4,7-dihydro-2H-pyrazole[3,4-b]pyridine-5-carboxamide | CHEMBL1276931
Type:
Small organic molecule
Emp. Form.:
C18H15N5O3S
Mol. Mass.:
381.408
SMILES:
CC1=Nc2[nH]ncc2C(C1C(=O)Nc1ccc(cc1)[N+]([O-])=O)c1cccs1
: