Target
Adenosine receptor A1
Ligand
BDBM50165819
Substrate
Meas. Tech.
ChEMBL_685066 (CHEMBL1286682)
Ki
3250±n/a nM
Citation
 Giovannoni, MPVergelli, CCilibrizzi, ACrocetti, LBiancalani, CGraziano, ADal Piaz, VLoza, MICadavid, MIDíaz, JLGavaldà, A Pyrazolo[1',5':1,6]pyrimido[4,5-d]pyridazin-4(3H)-ones as selective human A(1) adenosine receptor ligands. Bioorg Med Chem 18:7890-9 (2010)  
Target
Name:
Adenosine receptor A1
Synonyms:
A1 adenosine receptor (hA1) AA1R_HUMAN ADORA1 Adenosine A1-receptor Adenosine receptor A1 (hA1) | Adenosine transporter (AdT)
Type:
G Protein-Coupled Receptor (GPCR)
Mol. Mass.:
36520.92
Organism:
Homo sapiens (Human)
Description:
P30542
Residue:
326
  
Inhibitor
Name:
BDBM50165819
Synonyms:
7-Benzyl-4,9-dimethyl-2-phenyl-7H-3,3a,5,7,8-pentaaza-cyclopenta[a]naphthalen-6-one | CHEMBL382494
Type:
Small organic molecule
Emp. Form.:
C23H19N5O
Mol. Mass.:
381.4299
SMILES:
Cc1nn(Cc2ccccc2)c(=O)c2nc(C)n3nc(cc3c12)-c1ccccc1
: