Target
Adenosine receptor A2b
Ligand
BDBM50094037
Substrate
Meas. Tech.
ChEMBL_685068 (CHEMBL1286684)
Ki
>10000±n/a nM
Citation
 Giovannoni, MPVergelli, CCilibrizzi, ACrocetti, LBiancalani, CGraziano, ADal Piaz, VLoza, MICadavid, MIDíaz, JLGavaldà, A Pyrazolo[1',5':1,6]pyrimido[4,5-d]pyridazin-4(3H)-ones as selective human A(1) adenosine receptor ligands. Bioorg Med Chem 18:7890-9 (2010)  
Target
Name:
Adenosine receptor A2b
Synonyms:
AA2BR_HUMAN ADORA2B Adenosine receptors A2b | Adenosine receptors; A2a & A2b
Type:
G Protein-Coupled Receptor (GPCR)
Mol. Mass.:
36341.22
Organism:
Homo sapiens (Human)
Description:
Residue:
332
  
Inhibitor
Name:
BDBM50094037
Synonyms:
2-Furan-2-yl-7-[3-(4-methoxy-phenyl)-propyl]-7H-pyrazolo[4,3-e][1,2,4]triazolo[1,5-c]pyrimidin-5-ylamine SCH-442416
Type:
Small organic molecule
Emp. Form.:
C20H19N7O2
Mol. Mass.:
389.4106
SMILES:
COc1ccc(CCCn2ncc3c2nc(N)n2nc(nc32)-c2ccco2)cc1
: