Target
Transient receptor potential cation channel subfamily V member 1
Ligand
BDBM50330647
Substrate
Meas. Tech.
ChEMBL_685077 (CHEMBL1286693)
Ki
850±n/a nM
Citation
 Kang, DWKim, YSLim, KSKim, MSPearce, LVPavlyukovets, VATao, AKLang-Kuhs, KABlumberg, PMLee, J Halogenation of 4-hydroxy/amino-3-methoxyphenyl acetamide TRPV1 agonists showed enhanced antagonism to capsaicin. Bioorg Med Chem 18:8092-105 (2010)  
Target
Name:
Transient receptor potential cation channel subfamily V member 1
Synonyms:
Capsaicin receptor TRPV1_RAT Trpv1 Vanilloid VR1 Vanilloid receptor 1 (VRI/TRPV1) Vanilloid receptor type 1-like (TrpV1/Vr1) Vr1l | osm-9-like TRP channel 1
Type:
Transient Receptor
Mol. Mass.:
94956.12
Organism:
Rattus norvegicus (rat)
Description:
O35433
Residue:
838
  
Inhibitor
Name:
BDBM50330647
Synonyms:
CHEMBL1277209 | N-(4-tert-Butyl-benzyl)-2-(4-hydroxy-2-iodo-5-methoxyphenyl)acetamide
Type:
Small organic molecule
Emp. Form.:
C20H24INO3
Mol. Mass.:
453.3139
SMILES:
COc1cc(CC(=O)NCc2ccc(cc2)C(C)(C)C)c(I)cc1O
: