Target
Adenosine receptor A3
Ligand
BDBM50299703
Substrate
Meas. Tech.
ChEMBL_685335 (CHEMBL1287450)
Ki
0.426580±n/a nM
Citation
 Dal Ben, DBuccioni, MLambertucci, CMarucci, GThomas, AVolpini, RCristalli, G Molecular modeling study on potent and selective adenosine A(3) receptor agonists. Bioorg Med Chem 18:7923-30 (2010)  
Target
Name:
Adenosine receptor A3
Synonyms:
A3 adenosine receptor (hA3) ADORA3 | Adenosine A3 receptor (A3AR)
Type:
G Protein-Coupled Receptor (GPCR)
Mol. Mass.:
36197.32
Organism:
Homo sapiens (Human)
Description:
P0DMS8
Residue:
318
  
Inhibitor
Name:
BDBM50299703
Synonyms:
2-(4-Fluorophenyl)ethynyl-N6-methyl-5'-N-methylcarboxamidoadenosine | CHEMBL573269
Type:
Small organic molecule
Emp. Form.:
C20H19FN6O4
Mol. Mass.:
426.4011
SMILES:
CNC(=O)[C@H]1O[C@H]([C@H](O)[C@@H]1O)n1cnc2c(NC)nc(nc12)C#Cc1ccc(F)cc1
: