Target
Sodium-dependent serotonin transporter
Ligand
BDBM50330791
Substrate
Meas. Tech.
ChEMBL_685452 (CHEMBL1285351)
Ki
>70±n/a nM
Citation
 Altenbach, RJBlack, LAStrakhova, MIManelli, AMCarr, TLMarsh, KCWetter, JMWensink, EJHsieh, GCHonore, PGarrison, TRBrioni, JDCowart, MD Diaryldiamines with dual inhibition of the histamine H(3) receptor and the norepinephrine transporter and the efficacy of 4-(3-(methylamino)-1-phenylpropyl)-6-(2-(pyrrolidin-1-yl)ethoxy)naphthalen-1-ol in pain. J Med Chem 53:7869-73 (2010)  
Target
Name:
Sodium-dependent serotonin transporter
Synonyms:
5-HT Transporter 5HTT SC6A4_HUMAN SLC6A4 Serotonin transporter (5HTT) Sodium-dependent serotonin transporter (SERT) | Solute carrier family 6 member 4
Type:
Multi-pass membrane protein
Mol. Mass.:
70322.51
Organism:
Homo sapiens (Human)
Description:
P31645
Residue:
630
  
Inhibitor
Name:
BDBM50330791
Synonyms:
CHEMBL1277595 | N-Methyl-4-phenyl-4-(4-(2-(pyrrolidin-1-yl)ethoxy)phenyl)-butan-1-amine
Type:
Small organic molecule
Emp. Form.:
C23H32N2O
Mol. Mass.:
352.513
SMILES:
CNCCCC(c1ccccc1)c1ccc(OCCN2CCCC2)cc1
: