Target
Nitric oxide synthase, brain
Ligand
BDBM50255365
Substrate
Meas. Tech.
ChEMBL_685658 (CHEMBL1285560)
Ki
4060±n/a nM
Citation
 Ji, HDelker, SLLi, HMartásek, PRoman, LJPoulos, TLSilverman, RB Exploration of the active site of neuronal nitric oxide synthase by the design and synthesis of pyrrolidinomethyl 2-aminopyridine derivatives. J Med Chem 53:7804-24 (2010)  
Target
Name:
Nitric oxide synthase, brain
Synonyms:
Bnos NC-NOS NOS type I nNOS Neuronal nitric oxide synthase Nitric Oxide Synthase, brain Nitric oxide synthase, brain (nNOS) Nitric-oxide synthase, brain (nNOS) Nos1 | Peptidyl-cysteine S-nitrosylase NOS1
Type:
Enzyme
Mol. Mass.:
160570.98
Organism:
Rattus norvegicus (rat)
Description:
Recombinant nNOS overexpressed in E. coli was used in enzyme assays.
Residue:
1429
  
Inhibitor
Name:
BDBM50255365
Synonyms:
(+/-)-cis-N1-((3S,4S)-4-((6-amino-4-methylpyridin-2-yl)methyl)pyrrolidin-3-yl)-N2-(3-fluorophenethyl)ethane-1,2-diamine CHEMBL480419 N1-{(+/-)-4''-[(6''''-amino-4''''-methylpyridin-2''''-yl)methyl]pyrrolidin-3-yl}-N2-(3''-fluorophenethyl)ethane-1,2-diamine
Type:
Small organic molecule
Emp. Form.:
C21H30FN5
Mol. Mass.:
371.4948
SMILES:
Cc1cc(N)nc(C[C@H]2CNC[C@H]2NCCNCCc2cccc(F)c2)c1
: